{"text_format":"1","workbook":"xlsx","n_sheets":10,"sheets":["Cowculator Home","Cattle","Balancer","Feed List"," Summary","BCS","Finish Weight","Nutrient and Energy Balance","Requirement Calculator","Feed Categories"],"not_rendered":{"charts":1,"images":11,"macros":1,"external_links":5,"defined_names":142,"comments":4,"pivot_tables":0},"unopened":[],"bounds":{"document_bytes":16777216,"sheet_cells":100000,"rows_first":2000,"rows_last":500,"rows_between":2000,"halvings":0,"cell_chars":16384,"cell_head_chars":4096},"cells_cut":0,"cells_raw":0,"read":"whole","date_system":"1900"}

{"sheet":"Cowculator Home","index":0,"n_rows":13,"n_cols":5,"rows_kept":13,"cut":false,"hidden":false,"merged":[[7,1,7,3],[8,1,8,3],[9,1,9,3]]}
[]
[]
[]
[]
[]
[]
[]
[null,"      Oklahoma State University"]
[null,"      Department of Animal and Food Sciences"]
[null,"      M.A. Gross, D.L. Lalman, and P.A Beck"]
{"$rows_left_out":4}
{"sheet":"Cattle","index":1,"n_rows":51,"n_cols":23,"rows_kept":51,"cut":false,"hidden":false,"merged":[[7,7,7,9],[2,19,2,21],[4,22,4,24],[2,2,2,3],[6,1,6,2],[5,1,5,2],[3,2,3,3],[2,5,2,9],[3,5,3,9],[5,7,5,9],[6,7,6,9],[16,6,16,8],[17,6,17,8],[19,6,19,8],[20,6,20,8],[18,6,18,8]]}
[]
[]
[null,"Client","Pistol Pete, Bullet Ranch",null,"Cattle Description","Angus cows, 1200 lb, BCS = 5",null,null,null,null,null,"Stage","Days","Day in Gestation",null,null,"Class of Cattle","Ionophore","Implant","Genetic Potential for Growth and Feed Efficiency"]
[null,"Contact Info","(405) 718-2134",null,"Ration ID","2020 dry cow precalving",null,null,null,null,null,"Mid Gestation, dry Cow",95,"94-189",null,null,"Growing and Finishing Cattle","Rumensin","Yes","Above Average",0.97,null,"Adjusts to 5% below default NASEM values (NASEM equations were extremely optimistic with 750 lb steers converting at 5.2:1)"]
[null,null,null,null,null,null,null,null,null,null,null,"Late Gestation, dry Cow",95,"189-283",null,null,"Mid Gestation, Bred Heifer","Bovatec","No","Average",0.89500000000000002,null,"Adjusts to Hitch and K-State newsletter data using 2016, 2017 and 2018 closeouts"]
[null,"Select Class of Cattle",null,null,"Feeding Period, Days",null,null,null,null,null,null,"Early Lactation, Mature Cow",90,"0 - 30",null,null,"Late Gestation, Bred Heifer","Cattlyst",null,"Below Average",0.82,null,"Adjusts to below average (Hitch data)"]
[null,"Late Gestation, Dry Cow",null,null,90,null,null,null,null,null,null,"Late Lactation, Mature Cow",120,"30 - 94",null,null,"Early Lactation, First Calf Heifer","None",null,"Decision",{"$f":"VLOOKUP(F15, T4:U6, 2,)","v":0.97}]
[null,null,null,null,null,null,null,null,null,null,null,"Mid Gestation, Bred Heifer ",95,"94-189",null,null,"Mid Gestation, Dry Cow"]
[null,"Inputs for Cows, Bred Heifers and Mature Bulls",null,null,null,null,null,null,null,null,null,"Late Gestation, Bred Heifer",95,"189-283",null,null,"Late Gestation, Dry Cow"]
[null,"Number of Cattle","Initial Weight, lb","Mature Weight, lb","Expected Calf Birth Weight, lb","Genetic Potential for Milk","Peak Milk, lb/day","Initial Body Condition Score","Desired Body Condition Score",null,null,"Early Lactation, First Calf Heifer",90,"0 - 30",null,null,"Early Lactation, Mature Cow"]
{"$rows_left_out":42}
{"sheet":"Balancer","index":2,"n_rows":34,"n_cols":26,"rows_kept":34,"cut":false,"hidden":false,"merged":[[18,3,18,4],[17,3,17,4],[22,3,22,4],[21,3,21,4],[20,3,20,4],[25,3,25,4],[23,3,23,4],[31,2,31,4],[32,2,32,4],[33,2,33,4],[2,10,2,12],[2,13,2,16],[28,5,28,6],[6,1,6,2],[7,1,7,2],[8,1,8,2],[12,3,12,4],[13,3,13,4],[7,3,7,4],[9,3,9,4],[10,3,10,4],[11,3,11,4],[8,3,8,4],[9,1,9,2],[10,1,10,2],[11,1,11,2],[5,15,5,16],[12,1,12,2],[13,1,13,2],[16,1,16,2],[14,1,14,2],[15,1,15,2],[5,5,6,5],[6,3,6,4],[14,3,14,4],[15,3,15,4],[16,3,16,4]]}
[" "]
[]
[null,{"$f":"Cattle!C3","v":"Pistol Pete, Bullet Ranch"},null,{"$f":"Cattle!F3","v":"Angus cows, 1200 lb, BCS = 5"},null,null,null,null,null,null,"Diet Concentration",null,null,"Daily Amount"]
[null,"Class of cattle:",null,{"$f":"Cattle!B7","v":"Late Gestation, Dry Cow"},null,null,null,null,null,"Nutrient","As Fed","DM","Required","  DM",null,"Required",null,"Status"]
[null,null,null,null,null,null,null,null,null,"Diet DM",{"$f":"'Nutrient and Energy Balance'!E33","v":0.90807999999999989},"-","-","-",null,"-",null,"-"]
[null,null,null,null,null,"lb or %",null,null,null,"TDN",{"$f":"'Nutrient and Energy Balance'!J36","v":0.50329219999999997},{"$f":"'Nutrient and Energy Balance'!J34","v":0.55423773235838258},"-",{"$f":"'Nutrient and Energy Balance'!J32/0.454","v":12.582305000000002},"lb","TDN:CP",null,{"$f":"N6/N12","v":6.8137215017063006}]
[null,"Feed Category",null,"Feed or Forage",null,null,"% As Fed","% DM",null,"ME, Mcal/lb",{"$f":"'Nutrient and Energy Balance'!K36","v":0.82609302932346396},{"$f":"'Nutrient and Energy Balance'!K35","v":0.90971393415058599},"-",{"$f":"'Nutrient and Energy Balance'!K32","v":20.652325733086602},"Mcal","-",null,"-"]
[null,"Harvested Forages",null,"Prairie Hay, mature",null,21.85,{"$f":"(F8/$F$18)*100","v":87.4},{"$f":"'Nutrient and Energy Balance'!E22/'Nutrient and Energy Balance'!$E$32*100","v":87.584794291251882},null,"NEm, Mcal/lb",{"$f":"'Nutrient and Energy Balance'!L36","v":0.47545585293499021},{"$f":"'Nutrient and Energy Balance'!L35","v":0.52358366326203676},"-",{"$f":"'Nutrient and Energy Balance'!L32","v":11.886396323374758},"Mcal","-",null,"-"]
[null,"Commercial Feeds",null,"Range Cube, 25%",null,3,{"$f":"(F9/$F$18)*100","v":12},{"$f":"'Nutrient and Energy Balance'!E23/'Nutrient and Energy Balance'!$E$32*100","v":11.76107831909083},null,"NEg, Mcal/lb",{"$f":"'Nutrient and Energy Balance'!M36","v":0.24476130447997493},{"$f":"'Nutrient and Energy Balance'!M35","v":0.26953716025017072},"-",{"$f":"'Nutrient and Energy Balance'!M32","v":6.1190326119993745},"Mcal","-",null,"-"]
[null,"Mineral and Vitamins",null,"B-350 RCRC Mineral",null,0.15,0.6,{"$f":"'Nutrient and Energy Balance'!E24/'Nutrient and Energy Balance'!$E$32*100","v":0.654127389657299},null,"NDF",{"$f":"'Nutrient and Energy Balance'!Z36","v":0.61263819999999991},{"$f":"'Nutrient and Energy Balance'!Z34","v":0.67465223328341117},"-",{"$f":"'Nutrient and Energy Balance'!Z32*0.454","v":3.1568633807800004},"lb","-",null,"-"]
{"$rows_left_out":25}
{"sheet":"Feed List","index":3,"n_rows":150,"n_cols":97,"rows_kept":150,"cut":false,"hidden":false,"merged":[[1,6,1,7],[1,24,1,29],[1,1,1,2],[1,8,1,14],[1,3,1,4],[1,15,1,16],[1,18,1,23]]}
[]
[null,"Dry Matter Basis",null,"Units and Cost",null,"DM","Protein",null,"Energy",null,null,null,null,null,null,"Fiber",null,"Fat","Macromineral",null,null,null,null,null,"Trace mineral"]
[null,null,null,"Units","Cost","DM","Protein","DIP","TDN","ME","ME","NE m","NE m","NE g","NE g","NDF","peNDF","FAT","CA","Phos","Na","K","MG","S","CO","CU","FE","MN","SE","ZN"]
[null,"Number","FEED NAME ","LB.","$/Unit","%","%","% of CP","%","Mcal/kg","Mcal/lb","Mcal/kg","Mcal/lb","Mcal/kg","Mcal/lb","%","% of NDF","%","%","%","%","%","%","%","ppm","ppm","ppm","ppm","ppm","ppm"]
[null,null,"Grazed forages"]
[null,1,"Alfalfa, fresh and greenchop",2000,60,25,23,78,61,{"$f":"(I6/100*4.409)*0.82","v":2.2053817999999996},{"$f":"J6*0.454","v":1.0012433371999998},{"$f":"IF(I6<29,0,((1.37*J6)-(0.138*J6^2)+(0.0105*J6^3))-1.12)","v":1.3428077580936262},{"$f":"L6*0.454","v":0.60963472217450632},{"$f":"IF(I6<38,0,((1.42*J6)-(0.174*J6^2)+(0.0122*J6^3)-1.65))","v":0.76621809786756634},{"$f":"N6*0.454","v":0.34786301643187512},36,0.8,2,1.8,0.34,0.08,2.9,0.36,0.33,0.4,8.3000000000000007,198,48,0.3,23]
[null,{"$f":"B6+1","v":2},"Bermuda, vegetative",2000,40,30,16,85,65,{"$f":"(I7/100*4.409)*0.82","v":2.3499969999999997},{"$f":"J7*0.454","v":1.0668986379999998},1.4736600014231738,{"$f":"L7*0.454","v":0.66904164064612093},0.88441266202870761,{"$f":"N7*0.454","v":0.40152334856103328},64,0.8,3,0.46,0.31,0.04,1.9,0.22,0.33,0.1,11,500,77,0.2,41]
[null,{"$f":"B7+1","v":3},"Bermuda, boot stage",2000,40,35,13,75,60,{"$f":"(I8/100*4.409)*0.82","v":2.1692279999999999},{"$f":"J8*0.454","v":0.98482951200000002},1.3096542601976631,{"$f":"L8*0.454","v":0.59458303412973901},0.73606845483613181,{"$f":"N8*0.454","v":0.33417507849560385},66,0.9,2.7,0.59,0.28000000000000003,0.04,1.9,0.21,0.3,0.1,12,400,160,0.18,36]
[null,4,"Bermuda, fall, mature",2000,40,80,8,60,48,1.7353823999999998,0.7878636095999999,0.89675474365246233,0.40712665361821793,0.35399251957290367,0.16071260388609826,70,1,2.1,0.26,0.18,0.03,1.3,0.2,0.21,0.1,9,300,140,0.15,20]
[null,5,"Bermuda, winter, mature",2000,40,90,5,55,44,1.5907671999999999,0.72220830879999998,0.7524042597974181,0.34159153394802783,0.21768652037309155,9.8829680249383572E-2,72,1,1.5,0.3,0.15,0.02,1,0.1,0.21,0.1,7,200,45,0.12,15]
{"$rows_left_out":141}
{"sheet":" Summary","index":4,"n_rows":38,"n_cols":20,"rows_kept":38,"cut":false,"hidden":false,"merged":[[24,8,24,9],[24,10,24,11],[35,7,35,11],[36,7,36,11],[37,7,37,11],[34,7,34,11],[3,8,3,11],[4,8,4,11],[30,6,30,11],[31,6,31,11],[32,6,32,11],[26,8,26,10],[27,8,27,10],[10,9,10,11],[7,9,7,10],[28,8,28,10],[29,8,29,10],[25,8,25,10]]}
[]
[]
[]
[null,null,null,null,null,null,{"$f":"Cattle!C3","v":"Pistol Pete, Bullet Ranch"},null,{"$f":"Cattle!F3","v":"Angus cows, 1200 lb, BCS = 5"}]
[null,null,null,null,null,null,{"$f":"Cattle!C4","v":"(405) 718-2134"},null,{"$f":"Cattle!F4","v":"2020 dry cow precalving"}]
[]
[]
[null,null,null,null,null,null,"Batch Size, lb",2000,null,"Diet Dry Matter, %",null,{"$f":"S23","v":90.807999999999993}]
[]
[]
{"$rows_left_out":29}
{"sheet":"BCS","index":5,"n_rows":20,"n_cols":10,"rows_kept":20,"cut":false,"hidden":false,"merged":[[14,7,19,7],[14,9,15,9],[16,9,17,9],[18,9,19,9],[2,7,7,7],[2,9,3,9],[4,9,5,9],[6,9,7,9],[8,7,13,7],[8,9,9,9],[10,9,11,9],[12,9,13,9]]}
[]
[null,null,null,null,null,null,null,null,"BCS","Description"]
[null,null,null,null,null,null,null,"Thin",1,"No palpable fat over spinous processes, transverse processes, hip bones, or ribs.  Tail head and ribs project quite prominently. "]
[null,null,null,null,null,null,null,null,"Emaciated"]
[null,null,1,null,null,null,null,null,2,"Tail head and ribs are less prominent.  Individual spinous processes are still sharp to the touch, but some tissue cover on dorsal portion of ribs. "]
[null,null,null,null,null,null,null,null,"Very Thin"]
[null,null,null,null,null,null,null,null,3,"Ribs are individually identifiable but not as sharp to the touch. Obvious palpable fat along spine and over tail head with some tissue cover on dorsal portion of the ribs."]
[null,null,null,null,null,null,null,null,"Thin"]
[null,null,3,null,null,null,null,"Optimum/moderate",4,"Individual ribs are no longer visually obvious.  The spinous processes can be identified individually on palpation but feel rounded rather than sharp.  Some fat cover over ribs, transverse processes, and hip bones. "]
[null,null,null,null,null,null,null,null,"Borderline "]
{"$rows_left_out":11}
{"sheet":"Finish Weight","index":6,"n_rows":0,"n_cols":0,"rows_kept":0,"cut":false,"hidden":false,"merged":[]}

{"sheet":"Nutrient and Energy Balance","index":7,"n_rows":94,"n_cols":32,"rows_kept":94,"cut":false,"hidden":true,"merged":[[0,1,0,4]]}
[null,"Nutrient and Energy Balance",null,null,null,null,null,null,null,"Nutrient and Energy Balance"]
[]
[]
[]
[]
[null,null,null,null,null,"Dietary Components, Nutrient Concentration",null,null,null,null,null,null,null,null,null,null,null,null,null,null,null,null,null,null,null,null,"peNDF"]
[null,"Feed Ingredient","Units","Unit Cost","Lb as fed","Cost/day","Cost/d","D.M. %","PROT %","TDN %","ME Mcal/kg","NEM Mcal/kg","NEG Mcal/kg","CA%","PHOS %","Na, %","K%","MG %","S %","CO ppm","CU ppm","FE ppm","MN ppm","SE ppm","ZN ppm","NDF%","% of NDF","Fat %","Na","Cl"]
[null,{"$f":"Balancer!D8","v":"Prairie Hay, mature"},{"$f":"IFERROR(VLOOKUP(Balancer!D8,'Feed List'!C5:AD168,2,),)","v":2000},{"$f":"IFERROR(VLOOKUP(Balancer!D8,'Feed List'!C5:AD154,3,),)","v":55},{"$f":"Balancer!$F$19*(Balancer!G8/100)","v":21.85},{"$f":"IFERROR((D8/C8)*E8,)","v":0.60087500000000005},{"$f":"IF(E8 = 0,0,F8)","v":0.60087500000000005},{"$f":"IFERROR(VLOOKUP(B8,'Feed List'!$C$5:AD168,4,FALSE),0)","v":91},{"$f":"IFERROR(VLOOKUP(Balancer!D8,'Feed List'!C5:AD168,5,),)","v":5.5},{"$f":"IFERROR(VLOOKUP(Balancer!D8,'Feed List'!C3:AD168,7,),)","v":53},{"$f":"IFERROR(VLOOKUP(Balancer!D8,'Feed List'!C5:AD168,8,),)*$L$40","v":1.9161513999999999},{"$f":"IF(J8<29,0,(1.37*K8-0.138*K8^2+0.0105*K8^3-1.12))","v":1.0723134377190071},{"$f":"IF(J8<38,0,(1.42*K8-0.174*K8^2+0.0122*K8^3-1.65))","v":0.51790230335738707},{"$f":"IFERROR(VLOOKUP(Balancer!$D8,'Feed List'!C5:AD168,17,),)","v":0.4},{"$f":"IFERROR(VLOOKUP(Balancer!D8,'Feed List'!C5:AD156,18,),)","v":0.15},{"$f":"IFERROR(VLOOKUP(Balancer!D8,'Feed List'!$C$5:$AE$156,19,),)","v":0.01},{"$f":"IFERROR(VLOOKUP(Balancer!D8,'Feed List'!$C$5:$AD$156,20,),)","v":1.1000000000000001},{"$f":"IFERROR(VLOOKUP(Balancer!D8,'Feed List'!$C$5:$AD$156,21,),)","v":0.2},{"$f":"IFERROR(VLOOKUP(Balancer!D8,'Feed List'!$C$5:$AD$156,22,),)","v":0.22},{"$f":"IFERROR(VLOOKUP(Balancer!D8,'Feed List'!$C$5:$AD$156,23,),)","v":0.15},{"$f":"IFERROR(VLOOKUP(Balancer!D8,'Feed List'!$C$5:$AD$156,24,),)","v":6},{"$f":"IFERROR(VLOOKUP(Balancer!D8,'Feed List'!$C$5:$AD$156,25,),)","v":300},{"$f":"IFERROR(VLOOKUP(Balancer!D8,'Feed List'!$C$5:$AD$156,26,),)","v":80},{"$f":"IFERROR(VLOOKUP(Balancer!D8,'Feed List'!$C$5:$AD$156,27,),)","v":0.11},{"$f":"IFERROR(VLOOKUP(Balancer!D8,'Feed List'!$C5:$AD156,28,),)","v":18},{"$f":"IFERROR(VLOOKUP(Balancer!D8,'Feed List'!$C$5:$AD$156,14,),)","v":73},{"$f":"IFERROR(VLOOKUP(Balancer!$D8,'Feed List'!$C$5:$AD$156,15,),)","v":1},{"$f":"IFERROR(VLOOKUP(Balancer!$D8,'Feed List'!$C$5:$AD$156,16,),)","v":2}]
[null,{"$f":"Balancer!D9","v":"Range Cube, 25%"},{"$f":"IFERROR(VLOOKUP(Balancer!D9,'Feed List'!C5:AD168,2,),)","v":2000},{"$f":"IFERROR(VLOOKUP(Balancer!D9,'Feed List'!C5:AD154,3,),)","v":360},{"$f":"Balancer!$F$19*(Balancer!G9/100)","v":3},0.54,{"$f":"IF(E9 = 0,0,F9)","v":0.54},{"$f":"IFERROR(VLOOKUP(B9,'Feed List'!$C$5:AD1168,4,FALSE),0)","v":89},{"$f":"IFERROR(VLOOKUP(Balancer!D9,'Feed List'!C5:AD168,5,),)","v":28},{"$f":"IFERROR(VLOOKUP(Balancer!D9,'Feed List'!C4:AD168,7,),)","v":76},{"$f":"IFERROR(VLOOKUP(Balancer!D9,'Feed List'!C5:AD168,8,),)*$L$40","v":2.7476887999999997},{"$f":"IF(J9<29,0,(1.37*K9-0.138*K9^2+0.0105*K9^3-1.12))","v":1.8202791985683366},{"$f":"IF(J9<38,0,(1.42*K9-0.174*K9^2+0.0122*K9^3-1.65))","v":1.1911366861696902},{"$f":"IFERROR(VLOOKUP(Balancer!$D9,'Feed List'!C$5:AD168,17,),)","v":2},{"$f":"IFERROR(VLOOKUP(Balancer!D9,'Feed List'!C5:AD156,18,),)","v":1.1000000000000001},{"$f":"IFERROR(VLOOKUP(Balancer!D9,'Feed List'!$C$5:$AE$156,19,),)","v":1},{"$f":"IFERROR(VLOOKUP(Balancer!D9,'Feed List'!$C$5:$AD$156,20,),)","v":0},{"$f":"IFERROR(VLOOKUP(Balancer!D9,'Feed List'!$C$5:$AD$156,21,),)","v":0},{"$f":"IFERROR(VLOOKUP(Balancer!D9,'Feed List'!$C$5:$AD$156,22,),)","v":0},{"$f":"IFERROR(VLOOKUP(Balancer!D9,'Feed List'!$C$5:$AD$156,23,),)","v":0},{"$f":"IFERROR(VLOOKUP(Balancer!D9,'Feed List'!$C$5:$AD$156,24,),)","v":0},{"$f":"IFERROR(VLOOKUP(Balancer!D9,'Feed List'!$C$5:$AD$156,25,),)","v":0},{"$f":"IFERROR(VLOOKUP(Balancer!D9,'Feed List'!$C$5:$AD$156,26,),)","v":0},{"$f":"IFERROR(VLOOKUP(Balancer!D9,'Feed List'!$C$5:$AD$156,27,),)","v":0},{"$f":"IFERROR(VLOOKUP(Balancer!D9,'Feed List'!$C6:$AD157,28,),)","v":0},{"$f":"IFERROR(VLOOKUP(Balancer!D9,'Feed List'!$C$5:$AD$156,14,),)","v":30},{"$f":"IFERROR(VLOOKUP(Balancer!D9,'Feed List'!$C$5:$AD$156,15,),)","v":0.3},{"$f":"IFERROR(VLOOKUP(Balancer!$D9,'Feed List'!$C$5:$AD$156,16,),)","v":0}]
[null,{"$f":"Balancer!D10","v":"B-350 RCRC Mineral"},{"$f":"IFERROR(VLOOKUP(Balancer!D10,'Feed List'!C5:AD168,2,),0)","v":2000},{"$f":"IFERROR(VLOOKUP(Balancer!D10,'Feed List'!C5:AD154,3,),)","v":1075},{"$f":"Balancer!$F$19*(Balancer!G10/100)","v":0.15},{"$f":"IFERROR((D10/C10)*E10,)","v":8.0624999999999988E-2},8.0624999999999988E-2,{"$f":"IFERROR(VLOOKUP(B10,'Feed List'!$C$5:AD168,4,FALSE),0)","v":99},{"$f":"IFERROR(VLOOKUP(Balancer!D10,'Feed List'!C5:AD168,5,),)","v":3.65},{"$f":"IFERROR(VLOOKUP(Balancer!D10,'Feed List'!C5:AD168,7,),)","v":10},{"$f":"IFERROR(VLOOKUP(Balancer!D10,'Feed List'!C5:AD168,8,),)*$L$40","v":0.36080000000000001},0,0,{"$f":"IFERROR(VLOOKUP(Balancer!$D10,'Feed List'!C$5:AD168,17,),)","v":10},{"$f":"IFERROR(VLOOKUP(Balancer!D10,'Feed List'!C5:AD156,18,),)","v":5},{"$f":"IFERROR(VLOOKUP(Balancer!D10,'Feed List'!$C$5:$AE$156,19,),)","v":7.6},{"$f":"IFERROR(VLOOKUP(Balancer!D10,'Feed List'!$C$5:$AD$156,20,),)","v":0.74},{"$f":"IFERROR(VLOOKUP(Balancer!D10,'Feed List'!$C$5:$AD$156,21,),)","v":1.07},{"$f":"IFERROR(VLOOKUP(Balancer!D10,'Feed List'!$C$5:$AD$156,22,),)","v":0.33},{"$f":"IFERROR(VLOOKUP(Balancer!D10,'Feed List'!$C$5:$AD$156,23,),)","v":149},{"$f":"IFERROR(VLOOKUP(Balancer!D10,'Feed List'!$C$5:$AD$156,24,),)","v":2022},{"$f":"IFERROR(VLOOKUP(Balancer!D10,'Feed List'!$C$5:$AD$156,25,),)","v":3734},{"$f":"IFERROR(VLOOKUP(Balancer!D10,'Feed List'!$C$5:$AD$156,26,),)","v":3110},{"$f":"IFERROR(VLOOKUP(Balancer!D10,'Feed List'!$C$5:$AD$156,27,),)","v":31},{"$f":"IFERROR(VLOOKUP(Balancer!D10,'Feed List'!$C7:$AD158,28,),)","v":6036},{"$f":"IFERROR(VLOOKUP(Balancer!D10,'Feed List'!$C$5:$AD$156,14,),)","v":0},{"$f":"IFERROR(VLOOKUP(Balancer!D10,'Feed List'!$C$5:$AD$156,15,),)","v":0},{"$f":"IFERROR(VLOOKUP(Balancer!$D10,'Feed List'!$C$5:$AD$156,16,),)","v":1.39}]
{"$rows_left_out":85}
{"sheet":"Requirement Calculator","index":8,"n_rows":86,"n_cols":72,"rows_kept":86,"cut":false,"hidden":true,"merged":[[3,43,3,53],[62,21,62,22],[4,21,4,22],[12,21,12,22],[20,21,20,22],[28,21,28,22],[36,21,36,22],[46,21,46,22],[54,21,54,22]]}
[null,"Requirement Calculator",null,null,null,null,null,null,null,null,null,null,null,null,null,null,null,null,null,"Nutrient Requirement Generator for Beef Cows",null,null,null,null,null,null,null,null,null,null,null,null,null,null,null,null,null,null,null,null,null,null,null,null,null,null,null,null,"Minimum"]
[null,null,null,null,null,null,null,null,null,null,null,null,null,null,null,null,null,null,null,"Oklahoma State University",null,null,null,null,null,null,null,null,null,null,null,null,null,null,null,null,null,null,null,null,null,null,null,null,null,null,null,null,"CP, lb/day"]
[1,2,3,4,5,6,7,8,9,10,11,12,13,14,15,16,17,18,19,20,21,22,23,24,25,26,27,28,29,30,31,32,33,34,35,36,37,38,39,40,41,42,43,44,45,46,47,48,49,50,51,52,53,54,55,56,57,58,59,60,61,62,63,64,65,66,67,68,69,70,71,72]
[null,"Gestating cow, middle 1/3 of pregnancy",null,null,null,null,null,null,null,null,null,null,null,null,null,null,null,null,null,null,null,null,null,null,null,null,null,null,null,null,null,null,null,null,null,null,null,null,null,null,null,null,null,"Calculations"]
[null,"Current",null,null,null,null,"Expected",null,"Current",null,null,null,null,"NEm","Gravid",null,"Predicted","Predicted",null,"NEm","NEm","Weight",null,"ME","ME","Neg","Actual","       Crude Protein",null,"Ca","Ca","Phos","Phos","Na","K","MG","S","CO","CU","FE","MN","SE","ZN",null,null,null,null,null,null,null,null,null,null,"Mid Gestation",null,null,null,null,null,null,null,null,null,null,null,null,null,null,null,"Days to"]
[null,"Weight",null,null,"BW.75",null,"Calf",null,"BCS","NEm",null,"NEm","NEm2","sup/req","Uterus",null,"DM Intake","DM Intake","Nem Sup","Req","Req","Initial","Final","Req","Req","Req","DM Intake","Req","Req","Req","Req","Req","Req","Req","Req","Req","Req","Req","Req","Req","Req","Req","Req","Maint MP",null,"Gest MP","Total MP","MP",null,"Nem maint",null,null,"Nem Gest","Energy",null,null,null,null,null,null,null,null,null,"Maternal","SWG","Fetal","Fetal","Total","Desired","gain or lose",null,"Number of"]
[null,"lb","Weight (kg)","SBW","MBW",null,"Birthweight",null,"(1-9)","Mcal/kg",null,"Mcal/lb","Mcal/kg","Ratio","ADG, lb",null,"lb/day","kg/day","Mcal/day","Mcal/day","Mcal/lb","lb","lb","Mcal/day","Mcal/kg","Mcal/kg","lb/day","lb/day","% of DM","g/day","% of DM","g/day","% of DM","% of DM","% of DM","% of DM","% of DM","ppm","ppm","ppm","ppm","ppm","ppm","g/day",null,"g/day","g/day","exponent",{"$f":"(AU8/0.67)/454","v":1.4233843827734036},"Mcal/day",null,null,"Mcal/day","exponent",null,null,null,null,null,null,null,null,null,"ADG, kg","lb","ADG, kg","ADG, lb","ADG,lb","ADG","one score",null,"Head"]
["Mid Gestation, Dry Cow",{"$f":"Cattle!C11","v":1200},{"$f":"B8*0.454","v":544.80000000000007},{"$f":"C8*0.96","v":523.00800000000004},{"$f":"D8^0.75","v":109.36572818847357},null,{"$f":"Cattle!E11","v":80},0,{"$f":"Cattle!H11","v":5},{"$f":"'Nutrient and Energy Balance'!L34","v":1.1532679807533848},null,{"$f":"J8*0.454","v":0.52358366326203665},{"$f":"J8^2","v":1.3300270354309895},{"$f":"S8/T8","v":1.3353578065869833},{"$f":"BQ8/0.454","v":0.65862095760178085},null,{"$f":"R8/0.454","v":22.509421268852456},{"$f":"(E8*(0.002263+(0.134788*J8)-(0.063407*J8^2)+(0.013081*J8^3)))","v":10.219277256059016},{"$f":"R8*J8","v":11.785565245854171},{"$f":"AX8+BA8","v":8.8257732779326634},{"$f":"T8/Q8","v":0.39209241199574413},{"$f":"Cattle!C$11","v":1200},{"$f":"V8+((BL8+BO8)*Cattle!E$7)","v":1228.5279445848921},{"$f":"T8/'Nutrient and Energy Balance'!L38","v":15.334567317412683},{"$f":"X8/R8","v":1.5005530169289427},null,{"$f":"Balancer!F22","v":22.701999999999998},{"$f":"IF(AW7 < AW8,AW8,AW7)","v":1.8007537015081965},{"$f":"(AB8/Q8)*100","v":8},{"$f":"((0.0154*D8)+(0.152*(G8*0.454)))/0.5","v":27.149926400000002},{"$f":"((AD8/454)/Q8)*100","v":0.2656736452071774},{"$f":"(0.016*D8)+(0.0844*((G8*0.454)))/0.68","v":12.876080941176472},{"$f":"((AF8/454)/Q8)*100","v":0.12599796070257549},7.0000000000000007E-2,0.6,0.12,0.15,0.15,10,50,40,0.1,30,{"$f":"3.8*E8","v":415.58976711619954},null,{"$f":"((G8*0.454)*(0.001669-(0.00000211*142))*EXP(AV8)*6.25)/0.65","v":17.375294435814329},{"$f":"AR8+AT8","v":432.96506155201388},{"$f":"(0.0278-(0.0000176*142))*142","v":3.5927135999999997},{"$f":"Q8*0.08","v":1.8007537015081965},{"$f":"E8*(Cattle!O19)*1*(0.8+(I16-1)*0.05)","v":8.4211610705124649},null,null,{"$f":"(($G8*0.454)*(0.576/0.13)*(0.05855-(0.0000996*142))*EXP(BB8))/1000","v":0.4046122074201986},{"$f":"(0.03233-(0.0000275*142))*(142)","v":4.0363499999999997},null,null,null,null,null,null,null,null,null,{"$f":"'Nutrient and Energy Balance'!R90","v":1.796324730314711E-2},{"$f":"BL8/0.454","v":3.9566624015742534E-2},{"$f":"(G8*0.454)*0.01828*(0.02-0.0000286*142)*EXP(0.02*142-0.0000143*142^2)","v":0.13575231729704867},{"$f":"BN8/0.454","v":0.29901391475120853},{"$f":"BM8+BO8","v":0.33858053876695104},{"$f":"'Nutrient and Energy Balance'!R81+BO8","v":0.29901391475120853},{"$f":"'Nutrient and Energy Balance'!$R$92","v":2068.6526090129441},null,{"$f":"Cattle!$B$11","v":10}]
[null,null,null,null,null,null,null,null,null,null,null,null,null,null,null,null,null,null,null,null,null,null,null,null,null,null,null,null,null,null,null,null,null,null,null,null,null,null,null,null,null,null,null,null,null,null,null,null,null,{"$f":"'Nutrient and Energy Balance'!K86^0.75*(Cattle!O19)*1*(0.8+(I16-1)*0.05)","v":8.4211610705124649}]
[]
{"$rows_left_out":77}
{"sheet":"Feed Categories","index":9,"n_rows":53,"n_cols":9,"rows_kept":53,"cut":false,"hidden":true,"merged":[[10,11,10,14],[11,11,11,14],[12,11,12,14],[13,11,13,14]]}
[]
[]
[null,"FEED CATEGORIES","Grazed Forages","Harvested Forages","Concentrates","Commercial Feeds","Mineral and vitamins","Select Feed Ingredient"]
[null,"Select Feed Ingredient",{"$f":"'Feed List'!C6","v":"Alfalfa, fresh and greenchop"},{"$f":"'Feed List'!C32","v":"Alfalfa Hay,early bloom"},{"$f":"'Feed List'!C67","v":"Barley Malt pellets with hulls"},{"$f":"'Feed List'!C106","v":"Alfalfa Pellets"},{"$f":"'Feed List'!C129","v":"Calcium Carbonate"},null,{"$f":"ISNUMBER(SEARCH($I$2,A4))","v":false}]
[null,"Grazed forages",{"$f":"'Feed List'!C7","v":"Bermuda, vegetative"},{"$f":"'Feed List'!C33","v":"Alfalfa Hay, mid bloom"},{"$f":"'Feed List'!C68","v":"Corn Gluten Feed"},{"$f":"'Feed List'!C107","v":"Aalfala Cubes"},{"$f":"'Feed List'!C130","v":"Cobalt Carbonate"},null,{"$f":"ISNUMBER(SEARCH($I$2,A5:C53))","v":false}]
[null,"Harvested Forages",{"$f":"'Feed List'!C8","v":"Bermuda, boot stage"},{"$f":"'Feed List'!C34","v":"Alfalfa Hay, full bloom"},{"$f":"'Feed List'!C69","v":"Corn Grain, rolled"},{"$f":"'Feed List'!C108","v":"Alfalfa Dehydrated, 17% CP"},{"$f":"'Feed List'!C131","v":"Cobalt Sulfate"},null,false]
[null,"Concentrates",{"$f":"'Feed List'!C9","v":"Bermuda, fall, mature"},{"$f":"'Feed List'!C35","v":"Alfalfa Silage"},{"$f":"'Feed List'!C70","v":"Corn Grain, steam flaked"},{"$f":"'Feed List'!C109","v":"Cane molasses"},{"$f":"'Feed List'!C132","v":"Copper Sulfate"},null,false]
[null,"Commercial Feeds",{"$f":"'Feed List'!C10","v":"Bermuda, winter, mature"},{"$f":"'Feed List'!C36","v":"Bermuda Hay, vegetative"},{"$f":"'Feed List'!C71","v":"Corn Grain, whole"},{"$f":"'Feed List'!C110","v":"Liquid 20%"},{"$f":"'Feed List'!C133","v":"Dicalcium phosphate"},null,false]
[null,"Mineral and Vitamins",{"$f":"'Feed List'!C11","v":"Bermuda, stockpiled, Sep-Oct"},{"$f":"'Feed List'!C37","v":"Bermuda Hay, early bloom"},{"$f":"'Feed List'!C72","v":"Cotton Seed Hulls"},{"$f":"'Feed List'!C111","v":"Liquid 25%"},{"$f":"'Feed List'!C134","v":"Limestone 38%"},null,false]
[null,null,{"$f":"'Feed List'!C12","v":"Bermuda, stockpiled, Nov-Dec"},{"$f":"'Feed List'!C38","v":"Bermuda Hay, full bloom"},{"$f":"'Feed List'!C73","v":"Cottonseed meal, 41%"},{"$f":"'Feed List'!C112","v":"Liquid 30%"},{"$f":"'Feed List'!C135","v":"Magnesium Oxide"},null,false]
{"$rows_left_out":43}